Bug 87293 - Build failure libreoffice-4-4 branch: undefined reference to symbol 'dlclose@@GLIBC_2.2.5'
Summary: Build failure libreoffice-4-4 branch: undefined reference to symbol 'dlclose@...
Alias: None
Product: LibreOffice
Classification: Unclassified
Component: LibreOffice (show other bugs)
(earliest affected)
Hardware: x86-64 (AMD64) Linux (All)
: medium normal
Assignee: Not Assigned
Depends on:
Reported: 2014-12-13 20:03 UTC by David Gerard
Modified: 2014-12-16 13:17 UTC (History)
1 user (show)

See Also:
Crash report or crash signature:
Regression By:


Note You need to log in before you can comment on or make changes to this bug.
Description David Gerard 2014-12-13 20:03:03 UTC
This is happening consistently for me, building latest libreoffice-4-4 from git.

[build LNK] Executable/vcldemo
/usr/bin/ld: /home/fun/libreoffice/workdir/LinkTarget/StaticLibrary/libglxtest.a(glxtest.o): undefined reference to symbol 'dlclose@@GLIBC_2.2.5'
/usr/lib/gcc/x86_64-linux-gnu/4.8/../../../x86_64-linux-gnu/libdl.so: error adding symbols: DSO missing from command line
collect2: error: ld returned 1 exit status
make[1]: *** [/home/fun/libreoffice/workdir/LinkTarget/Executable/icontest] Error 1
make[1]: *** Waiting for unfinished jobs....
make: *** [build] Error 2

This doesn't happen on master. It's happened on libreoffice-4-4 for the past few days.

I'm running an up-to-date Ubuntu 14.04.

I am attempting to build with the Google Drive connection:
./autogen.sh --enable-ext-google-docs
Comment 1 David Gerard 2014-12-13 20:07:18 UTC
$ git status
On branch libreoffice-4-4
Your branch is up-to-date with 'origin/libreoffice-4-4'.
Comment 2 Buovjaga 2014-12-16 13:17:20 UTC
This belongs to the development mailing list per https://wiki.documentfoundation.org/QA/BugReport#Not_all_bugs_go_to_Bugzilla